{"text_format":"1","workbook":"xlsx","n_sheets":5,"sheets":["Eingabe","Basis","Preisliste","Liste","Gewichte"],"not_rendered":{"charts":0,"images":0,"macros":1,"external_links":1,"defined_names":2,"comments":0,"pivot_tables":0},"unopened":[],"bounds":{"document_bytes":16777216,"sheet_cells":100000,"rows_first":2000,"rows_last":500,"rows_between":2000,"halvings":0,"cell_chars":16384,"cell_head_chars":4096},"cells_cut":0,"cells_raw":0,"read":"whole","date_system":"1900"}

{"sheet":"Eingabe","index":0,"n_rows":0,"n_cols":0,"rows_kept":0,"cut":false,"hidden":false,"merged":[]}

{"sheet":"Basis","index":1,"n_rows":4,"n_cols":3,"rows_kept":4,"cut":false,"hidden":true,"merged":[]}
["Teuerungszuschlag",38.4,"ab 01.01.2023"]
["Energiezuschlag",15.1,"ab 01.01.2023"]
["U-Schale",11.74,"ab 01.08.2022"]
["Teuerungszuschlag",9.23,"ab 01.01.2023"]

{"sheet":"Preisliste","index":2,"n_rows":263,"n_cols":15,"rows_kept":263,"cut":false,"hidden":true,"merged":[]}
[null,null,null,null,null,null,null,null,"ab 01.01.2023","ab 01.01.2023","ab 01.01.2023"]
["Artikelnummer","Artikelbezeichnung","Gefüllt","NF","Gewicht pro Palette","Stück/Palette","Preisliste 2022","Fracht 2022","Teuerungszuschlag pro TStück","Energiekostenzuschlag pro TStück","TZ/EKZ","Ab Werk pro TStück","Frei Bau pro TStück","U-Schale","Pos. PL"]
[1640,"evoton MZ 80 GH 36,5","ja",11.502079999999999,731,48,8680,355,{"$f":"IF(C3=\"ja\",ROUND(1000*1/1000*D3*Basis!$B$1,2),0)","v":441.68},{"$f":"IF(C3=\"ja\",ROUND(1000/F3*E3/1000*Basis!$B$4,2),IF(N3=\"ja\",ROUND(1000/F3*E3/1000*Basis!$B$3,2),ROUND(1000/F3*E3/1000*Basis!$B$2,2)))","v":140.57},{"$f":"I3+J3","v":582.25},{"$f":"G3+K3","v":9262.25},{"$f":"G3+H3+K3","v":9617.25},"nein",1]
[1648,"evoton MZ 80 GH 42,5","ja",13.39284,650,36,10110,405,{"$f":"IF(C4=\"ja\",ROUND(1000*1/1000*D4*Basis!$B$1,2),0)","v":514.29},{"$f":"IF(C4=\"ja\",ROUND(1000/F4*E4/1000*Basis!$B$4,2),IF(N4=\"ja\",ROUND(1000/F4*E4/1000*Basis!$B$3,2),ROUND(1000/F4*E4/1000*Basis!$B$2,2)))","v":166.65},{"$f":"I4+J4","v":680.93999999999994},{"$f":"G4+K4","v":10790.94},{"$f":"G4+H4+K4","v":11195.94},"nein",2]
[1645,"evoton Anfänger 36,5","ja",5.7046599999999996,768,84,5470,200,{"$f":"IF(C5=\"ja\",ROUND(1000*1/1000*D5*Basis!$B$1,2),0)","v":219.06},{"$f":"IF(C5=\"ja\",ROUND(1000/F5*E5/1000*Basis!$B$4,2),IF(N5=\"ja\",ROUND(1000/F5*E5/1000*Basis!$B$3,2),ROUND(1000/F5*E5/1000*Basis!$B$2,2)))","v":84.39},303.45,5773.45,5973.45,"nein",3]
[1644,"evoton Anfänger 42,5","ja",7.2904600000000004,690,60,6560,260,{"$f":"IF(C6=\"ja\",ROUND(1000*1/1000*D6*Basis!$B$1,2),0)","v":279.95},{"$f":"IF(C6=\"ja\",ROUND(1000/F6*E6/1000*Basis!$B$4,2),IF(N6=\"ja\",ROUND(1000/F6*E6/1000*Basis!$B$3,2),ROUND(1000/F6*E6/1000*Basis!$B$2,2)))","v":106.15},386.1,6946.1,7206.1,"nein",4]
[1710,"evoton MZ 65 36,5","ja",11.502079999999999,659,48,9990,340,{"$f":"IF(C7=\"ja\",ROUND(1000*1/1000*D7*Basis!$B$1,2),0)","v":441.68},{"$f":"IF(C7=\"ja\",ROUND(1000/F7*E7/1000*Basis!$B$4,2),IF(N7=\"ja\",ROUND(1000/F7*E7/1000*Basis!$B$3,2),ROUND(1000/F7*E7/1000*Basis!$B$2,2)))","v":126.72},568.4,10558.4,10898.4,"nein",5]
[1718,"evoton MZ 65 42,5","ja",13.39284,576,36,11930,385,{"$f":"IF(C8=\"ja\",ROUND(1000*1/1000*D8*Basis!$B$1,2),0)","v":514.29},{"$f":"IF(C8=\"ja\",ROUND(1000/F8*E8/1000*Basis!$B$4,2),IF(N8=\"ja\",ROUND(1000/F8*E8/1000*Basis!$B$3,2),ROUND(1000/F8*E8/1000*Basis!$B$2,2)))","v":147.68},{"$f":"I8+J8","v":661.97},{"$f":"G8+K8","v":12591.97},{"$f":"G8+H8+K8","v":12976.97},"nein",6]
[1715,"evoton Anfänger 36,5","ja",5.7046599999999996,785,84,5270,200,{"$f":"IF(C9=\"ja\",ROUND(1000*1/1000*D9*Basis!$B$1,2),0)","v":219.06},{"$f":"IF(C9=\"ja\",ROUND(1000/F9*E9/1000*Basis!$B$4,2),IF(N9=\"ja\",ROUND(1000/F9*E9/1000*Basis!$B$3,2),ROUND(1000/F9*E9/1000*Basis!$B$2,2)))","v":86.26},305.32,5575.32,5775.32,"nein",7]
[1714,"evoton Anfänger 42,5","ja",7.2904499999999999,624,60,6320,260,{"$f":"IF(C10=\"ja\",ROUND(1000*1/1000*D10*Basis!$B$1,2),0)","v":279.95},{"$f":"IF(C10=\"ja\",ROUND(1000/F10*E10/1000*Basis!$B$4,2),IF(N10=\"ja\",ROUND(1000/F10*E10/1000*Basis!$B$3,2),ROUND(1000/F10*E10/1000*Basis!$B$2,2)))","v":95.99},375.94,6695.94,6955.94,"nein",8]
[1730,"evoton MZ 75 G 36,5","ja",11.502079999999999,731,48,9620,355,{"$f":"IF(C11=\"ja\",ROUND(1000*1/1000*D11*Basis!$B$1,2),0)","v":441.68},{"$f":"IF(C11=\"ja\",ROUND(1000/F11*E11/1000*Basis!$B$4,2),IF(N11=\"ja\",ROUND(1000/F11*E11/1000*Basis!$B$3,2),ROUND(1000/F11*E11/1000*Basis!$B$2,2)))","v":140.57},582.25,10202.25,10557.25,"nein",9]
[1738,"evoton MZ 75 G 42,5","ja",13.39284,650,36,11210,405,{"$f":"IF(C12=\"ja\",ROUND(1000*1/1000*D12*Basis!$B$1,2),0)","v":514.29},{"$f":"IF(C12=\"ja\",ROUND(1000/F12*E12/1000*Basis!$B$4,2),IF(N12=\"ja\",ROUND(1000/F12*E12/1000*Basis!$B$3,2),ROUND(1000/F12*E12/1000*Basis!$B$2,2)))","v":166.65},680.93999999999994,11890.94,12295.94,"nein",10]
[1739,"evoton MZ 75 G 49,0","ja",15.44115,772,36,12470,465,{"$f":"IF(C13=\"ja\",ROUND(1000*1/1000*D13*Basis!$B$1,2),0)","v":592.94000000000005},{"$f":"IF(C13=\"ja\",ROUND(1000/F13*E13/1000*Basis!$B$4,2),IF(N13=\"ja\",ROUND(1000/F13*E13/1000*Basis!$B$3,2),ROUND(1000/F13*E13/1000*Basis!$B$2,2)))","v":197.93},790.87000000000012,13260.87,13725.87,"nein",11]
[1741,"evoton MZ Anfänger 30,0","ja",4.6887600000000003,530,72,4970,240,{"$f":"IF(C14=\"ja\",ROUND(1000*1/1000*D14*Basis!$B$1,2),0)","v":180.05},{"$f":"IF(C14=\"ja\",ROUND(1000/F14*E14/1000*Basis!$B$4,2),IF(N14=\"ja\",ROUND(1000/F14*E14/1000*Basis!$B$3,2),ROUND(1000/F14*E14/1000*Basis!$B$2,2)))","v":67.94},247.99,5217.99,5457.99,"nein",12]
[1747,"evoton MZ Eckziegel 30,0","ja",6.6710000000000003,804,72,7050,245,{"$f":"IF(C15=\"ja\",ROUND(1000*1/1000*D15*Basis!$B$1,2),0)","v":256.17},{"$f":"IF(C15=\"ja\",ROUND(1000/F15*E15/1000*Basis!$B$4,2),IF(N15=\"ja\",ROUND(1000/F15*E15/1000*Basis!$B$3,2),ROUND(1000/F15*E15/1000*Basis!$B$2,2)))","v":103.07},359.24,7409.24,7654.24,"nein",13]
[1745,"evoton MZ Anfänger 36,5","ja",5.7046599999999996,768,84,5270,200,{"$f":"IF(C16=\"ja\",ROUND(1000*1/1000*D16*Basis!$B$1,2),0)","v":219.06},{"$f":"IF(C16=\"ja\",ROUND(1000/F16*E16/1000*Basis!$B$4,2),IF(N16=\"ja\",ROUND(1000/F16*E16/1000*Basis!$B$3,2),ROUND(1000/F16*E16/1000*Basis!$B$2,2)))","v":84.39},303.45,5573.45,5773.45,"nein",14]
[1744,"evoton MZ Anfänger 42,5","ja",7.2904499999999999,690,60,6320,260,{"$f":"IF(C17=\"ja\",ROUND(1000*1/1000*D17*Basis!$B$1,2),0)","v":279.95},{"$f":"IF(C17=\"ja\",ROUND(1000/F17*E17/1000*Basis!$B$4,2),IF(N17=\"ja\",ROUND(1000/F17*E17/1000*Basis!$B$3,2),ROUND(1000/F17*E17/1000*Basis!$B$2,2)))","v":106.15},386.1,6706.1,6966.1,"nein",15]
[1742,"evoton MZ 80 GS 30,0","ja",9.4537700000000005,713,54,7480,325,{"$f":"IF(C18=\"ja\",ROUND(1000*1/1000*D18*Basis!$B$1,2),0)","v":363.02},{"$f":"IF(C18=\"ja\",ROUND(1000/F18*E18/1000*Basis!$B$4,2),IF(N18=\"ja\",ROUND(1000/F18*E18/1000*Basis!$B$3,2),ROUND(1000/F18*E18/1000*Basis!$B$2,2)))","v":121.87},484.89,7964.89,8289.89,"nein",16]
[1740,"evoton MZ 80 GS 36,5","ja",11.502079999999999,731,48,8370,355,{"$f":"IF(C19=\"ja\",ROUND(1000*1/1000*D19*Basis!$B$1,2),0)","v":441.68},{"$f":"IF(C19=\"ja\",ROUND(1000/F19*E19/1000*Basis!$B$4,2),IF(N19=\"ja\",ROUND(1000/F19*E19/1000*Basis!$B$3,2),ROUND(1000/F19*E19/1000*Basis!$B$2,2)))","v":140.57},582.25,8952.25,9307.25,"nein",17]
[1748,"evoton MZ 80 GS 42,5","ja",13.39284,650,36,9750,405,{"$f":"IF(C20=\"ja\",ROUND(1000*1/1000*D20*Basis!$B$1,2),0)","v":514.29},{"$f":"IF(C20=\"ja\",ROUND(1000/F20*E20/1000*Basis!$B$4,2),IF(N20=\"ja\",ROUND(1000/F20*E20/1000*Basis!$B$3,2),ROUND(1000/F20*E20/1000*Basis!$B$2,2)))","v":166.65},680.93999999999994,10430.94,10835.94,"nein",18]
[1749,"evoton MZ 80 GS 49,0","ja",15.44115,772,36,10850,465,{"$f":"IF(C21=\"ja\",ROUND(1000*1/1000*D21*Basis!$B$1,2),0)","v":592.94000000000005},{"$f":"IF(C21=\"ja\",ROUND(1000/F21*E21/1000*Basis!$B$4,2),IF(N21=\"ja\",ROUND(1000/F21*E21/1000*Basis!$B$3,2),ROUND(1000/F21*E21/1000*Basis!$B$2,2)))","v":197.93},790.87000000000012,11640.87,12105.87,"nein",19]
[1770,"evoton MZ 90 GMS 36,5","ja",11.502079999999999,765,48,8370,355,{"$f":"IF(C22=\"ja\",ROUND(1000*1/1000*D22*Basis!$B$1,2),0)","v":441.68},{"$f":"IF(C22=\"ja\",ROUND(1000/F22*E22/1000*Basis!$B$4,2),IF(N22=\"ja\",ROUND(1000/F22*E22/1000*Basis!$B$3,2),ROUND(1000/F22*E22/1000*Basis!$B$2,2)))","v":147.1},588.78,8958.7800000000007,9313.7800000000007,"nein",20]
[1778,"evoton MZ 90 GMS 42,5","ja",13.39284,650,36,9750,405,{"$f":"IF(C23=\"ja\",ROUND(1000*1/1000*D23*Basis!$B$1,2),0)","v":514.29},{"$f":"IF(C23=\"ja\",ROUND(1000/F23*E23/1000*Basis!$B$4,2),IF(N23=\"ja\",ROUND(1000/F23*E23/1000*Basis!$B$3,2),ROUND(1000/F23*E23/1000*Basis!$B$2,2)))","v":166.65},680.93999999999994,10430.94,10835.94,"nein",21]
[1752,"evoton MZ 90 G 30,0","ja",9.4537700000000005,713,54,7480,325,{"$f":"IF(C24=\"ja\",ROUND(1000*1/1000*D24*Basis!$B$1,2),0)","v":363.02},{"$f":"IF(C24=\"ja\",ROUND(1000/F24*E24/1000*Basis!$B$4,2),IF(N24=\"ja\",ROUND(1000/F24*E24/1000*Basis!$B$3,2),ROUND(1000/F24*E24/1000*Basis!$B$2,2)))","v":121.87},484.89,7964.89,8289.89,"nein",22]
[1759,"evoton MZ 90 G 49,0","ja",15.44115,772,36,10850,465,{"$f":"IF(C25=\"ja\",ROUND(1000*1/1000*D25*Basis!$B$1,2),0)","v":592.94000000000005},{"$f":"IF(C25=\"ja\",ROUND(1000/F25*E25/1000*Basis!$B$4,2),IF(N25=\"ja\",ROUND(1000/F25*E25/1000*Basis!$B$3,2),ROUND(1000/F25*E25/1000*Basis!$B$2,2)))","v":197.93},790.87000000000012,11640.87,12105.87,"nein",23]
[1720,"evoton MZ 70 36,5","ja",11.502079999999999,661,48,7630,340,{"$f":"IF(C26=\"ja\",ROUND(1000*1/1000*D26*Basis!$B$1,2),0)","v":441.68},{"$f":"IF(C26=\"ja\",ROUND(1000/F26*E26/1000*Basis!$B$4,2),IF(N26=\"ja\",ROUND(1000/F26*E26/1000*Basis!$B$3,2),ROUND(1000/F26*E26/1000*Basis!$B$2,2)))","v":127.1},568.78,8198.7800000000007,8538.7800000000007,"nein",24]
[1728,"evoton MZ 70 42,5","ja",13.39284,579,36,9150,385,{"$f":"IF(C27=\"ja\",ROUND(1000*1/1000*D27*Basis!$B$1,2),0)","v":514.29},{"$f":"IF(C27=\"ja\",ROUND(1000/F27*E27/1000*Basis!$B$4,2),IF(N27=\"ja\",ROUND(1000/F27*E27/1000*Basis!$B$3,2),ROUND(1000/F27*E27/1000*Basis!$B$2,2)))","v":148.44999999999999},662.74,9812.74,10197.74,"nein",25]
[1729,"evoton MZ 70 49,0","ja",15.44115,772,36,10490,465,{"$f":"IF(C28=\"ja\",ROUND(1000*1/1000*D28*Basis!$B$1,2),0)","v":592.94000000000005},{"$f":"IF(C28=\"ja\",ROUND(1000/F28*E28/1000*Basis!$B$4,2),IF(N28=\"ja\",ROUND(1000/F28*E28/1000*Basis!$B$3,2),ROUND(1000/F28*E28/1000*Basis!$B$2,2)))","v":197.93},790.87000000000012,11280.87,11745.87,"nein",26]
[1970,"ecoton-Plan 4-0,60-12,0 DF","nein",11.4557,{"$f":"ROUND((VLOOKUP(A29,Gewichte!A:E,5,FALSE)*F29),0)+16","v":641},48,9630,340,{"$f":"IF(C29=\"ja\",ROUND(1000*1/1000*D29*Basis!$B$1,2),0)","v":0},{"$f":"IF(C29=\"ja\",ROUND(1000/F29*E29/1000*Basis!$B$4,2),IF(N29=\"ja\",ROUND(1000/F29*E29/1000*Basis!$B$3,2),ROUND(1000/F29*E29/1000*Basis!$B$2,2)))","v":201.65},201.65,9831.65,10171.65,"nein",27]
[1978,"ecoton-Plan 4-0,60-14,0 DF","nein",13.33883,{"$f":"ROUND((VLOOKUP(A30,Gewichte!A:E,5,FALSE)*F30),0)+16","v":562},36,11130,385,{"$f":"IF(C30=\"ja\",ROUND(1000*1/1000*D30*Basis!$B$1,2),0)","v":0},{"$f":"IF(C30=\"ja\",ROUND(1000/F30*E30/1000*Basis!$B$4,2),IF(N30=\"ja\",ROUND(1000/F30*E30/1000*Basis!$B$3,2),ROUND(1000/F30*E30/1000*Basis!$B$2,2)))","v":235.73},235.73,11365.73,11750.73,"nein",28]
[1979,"ecoton-Plan 4-0,60-16,0 DF","nein",15.37889,654,36,13360,465,{"$f":"IF(C31=\"ja\",ROUND(1000*1/1000*D31*Basis!$B$1,2),0)","v":0},{"$f":"IF(C31=\"ja\",ROUND(1000/F31*E31/1000*Basis!$B$4,2),IF(N31=\"ja\",ROUND(1000/F31*E31/1000*Basis!$B$3,2),ROUND(1000/F31*E31/1000*Basis!$B$2,2)))","v":274.32},274.32,13634.32,14099.32,"nein",29]
[1985,"ecoton-Plan Anfänger 36,5","nein",5.7046599999999996,652,80,5100,195,{"$f":"IF(C32=\"ja\",ROUND(1000*1/1000*D32*Basis!$B$1,2),0)","v":0},{"$f":"IF(C32=\"ja\",ROUND(1000/F32*E32/1000*Basis!$B$4,2),IF(N32=\"ja\",ROUND(1000/F32*E32/1000*Basis!$B$3,2),ROUND(1000/F32*E32/1000*Basis!$B$2,2)))","v":123.07},123.07,5223.07,5418.07,"nein",30]
[1984,"ecoton-Plan Anfänger 42,5","nein",7.2904499999999999,756,60,6860,220,{"$f":"IF(C33=\"ja\",ROUND(1000*1/1000*D33*Basis!$B$1,2),0)","v":0},{"$f":"IF(C33=\"ja\",ROUND(1000/F33*E33/1000*Basis!$B$4,2),IF(N33=\"ja\",ROUND(1000/F33*E33/1000*Basis!$B$3,2),ROUND(1000/F33*E33/1000*Basis!$B$2,2)))","v":190.26},190.26,7050.26,7270.26,"nein",31]
[1980,"ecoton-Plan 6-0,60-12,0 DF","nein",11.4557,{"$f":"ROUND((VLOOKUP(A34,Gewichte!A:E,5,FALSE)*F34),0)+16","v":654},48,8120,340,{"$f":"IF(C34=\"ja\",ROUND(1000*1/1000*D34*Basis!$B$1,2),0)","v":0},{"$f":"IF(C34=\"ja\",ROUND(1000/F34*E34/1000*Basis!$B$4,2),IF(N34=\"ja\",ROUND(1000/F34*E34/1000*Basis!$B$3,2),ROUND(1000/F34*E34/1000*Basis!$B$2,2)))","v":205.74},205.74,8325.74,8665.74,"nein",32]
[1988,"ecoton-Plan 6-0,60-14,0 DF","nein",13.33883,{"$f":"ROUND((VLOOKUP(A35,Gewichte!A:E,5,FALSE)*F35),0)+16","v":581},36,9400,385,{"$f":"IF(C35=\"ja\",ROUND(1000*1/1000*D35*Basis!$B$1,2),0)","v":0},{"$f":"IF(C35=\"ja\",ROUND(1000/F35*E35/1000*Basis!$B$4,2),IF(N35=\"ja\",ROUND(1000/F35*E35/1000*Basis!$B$3,2),ROUND(1000/F35*E35/1000*Basis!$B$2,2)))","v":243.7},243.7,9643.7000000000007,10028.700000000001,"nein",33]
[1989,"ecoton-Plan 6-0,60-16,0 DF","nein",15.37889,{"$f":"ROUND((VLOOKUP(A36,Gewichte!A:E,5,FALSE)*F36),0)+16","v":667},36,11270,465,{"$f":"IF(C36=\"ja\",ROUND(1000*1/1000*D36*Basis!$B$1,2),0)","v":0},{"$f":"IF(C36=\"ja\",ROUND(1000/F36*E36/1000*Basis!$B$4,2),IF(N36=\"ja\",ROUND(1000/F36*E36/1000*Basis!$B$3,2),ROUND(1000/F36*E36/1000*Basis!$B$2,2)))","v":279.77},279.77,11549.77,12014.77,"nein",34]
[1981,"ecoton-Plan Eckziegel 36,5","nein",11.4557,674,48,10870,340,{"$f":"IF(C37=\"ja\",ROUND(1000*1/1000*D37*Basis!$B$1,2),0)","v":0},{"$f":"IF(C37=\"ja\",ROUND(1000/F37*E37/1000*Basis!$B$4,2),IF(N37=\"ja\",ROUND(1000/F37*E37/1000*Basis!$B$3,2),ROUND(1000/F37*E37/1000*Basis!$B$2,2)))","v":212.03},212.03,11082.03,11422.03,"nein",35]
[1940,"ecoton-Plan 8-0,65-12,0 DF","nein",11.4557,722,48,7550,340,{"$f":"IF(C38=\"ja\",ROUND(1000*1/1000*D38*Basis!$B$1,2),0)","v":0},{"$f":"IF(C38=\"ja\",ROUND(1000/F38*E38/1000*Basis!$B$4,2),IF(N38=\"ja\",ROUND(1000/F38*E38/1000*Basis!$B$3,2),ROUND(1000/F38*E38/1000*Basis!$B$2,2)))","v":227.13},227.13,7777.13,8117.13,"nein",36]
[1948,"ecoton-Plan 8-0,65-14,0 DF","nein",13.33883,623,36,9150,385,{"$f":"IF(C39=\"ja\",ROUND(1000*1/1000*D39*Basis!$B$1,2),0)","v":0},{"$f":"IF(C39=\"ja\",ROUND(1000/F39*E39/1000*Basis!$B$4,2),IF(N39=\"ja\",ROUND(1000/F39*E39/1000*Basis!$B$3,2),ROUND(1000/F39*E39/1000*Basis!$B$2,2)))","v":261.31},261.31,9411.31,9796.31,"nein",37]
[1932,"ecoton-Plan 6-0,65-10,0 DF","nein",9.4156499999999994,669,54,6320,280,{"$f":"IF(C40=\"ja\",ROUND(1000*1/1000*D40*Basis!$B$1,2),0)","v":0},{"$f":"IF(C40=\"ja\",ROUND(1000/F40*E40/1000*Basis!$B$4,2),IF(N40=\"ja\",ROUND(1000/F40*E40/1000*Basis!$B$3,2),ROUND(1000/F40*E40/1000*Basis!$B$2,2)))","v":187.07},187.07,6507.07,6787.07,"nein",38]
{"$rows_left_out":224}
{"sheet":"Liste","index":3,"n_rows":3,"n_cols":1,"rows_kept":3,"cut":false,"hidden":true,"merged":[]}
["Gefüllt"]
["ja"]
["nein"]

{"sheet":"Gewichte","index":4,"n_rows":1241,"n_cols":5,"rows_kept":1241,"cut":false,"hidden":true,"merged":[]}
["Artikelnr.","Kurztext","ME","Auslaufteil","Gewicht"]
[1,"Ziegel-Einhängedecken mit Ziegeltr.  21+0","qm","aktiv",0]
[2,"Ziegel-Einhängedecken mit Ziegelträger  18+3","qm","aktiv",0]
[3,"Zusatzträger","Stk","aktiv",0]
[5,"Deckennegativziegel","Stk","aktiv",8.6999999999999993]
[6,"Deckenziegel 18","Stk","aktiv",16]
[7,"Deckenziegel 21","Stk","aktiv",18]
[8,"Ziegel-Einhängedecken mit Ziegelträger  18+7","qm","aktiv",0]
[12,"Ziegel-Einhängedecken mit Ziegelträger  18+6","qm","aktiv",0]
[14,"Ziegel-Einhängedecken mit Ziegelträger  16+6","qm","aktiv",0]
[27,"Ziegel-Einhängedecken mit Ziegelträger  18+0","qm","aktiv",0]
[35,"Ziegel-Einhängedecken mit Ziegeltr.  21+4","Stk","aktiv",0]
[36,"Ziegel-Einhängedecken mit Ziegeltr.  25+0","qm","aktiv",0]
[37,"Deckenziegel 25","Stk","aktiv",16]
[38,"Ziegel-Einhängedecken mit Ziegeltr.  25+7","qm","aktiv",0]
[40,"Schubzulage DH-Träger 100 cm","qm","aktiv",0]
[41,"Einhängeschalen für Querrippe 48 cm","qm","aktiv",0]
[42,"Integriertes Abhängesystem","qm","aktiv",0]
[100,"HLZ Dünnformat","Stk","aktiv",1.2]
[105,"HLZ NF","Stk","aktiv",1.5]
[106,"HLZ NF Rd. 1,2","Stk","aktiv",1.9990000000000001]
[110,"HLZ HF","Stk","aktiv",2.4]
[112,"HLZ HF Rd. 1,2","Stk","aktiv",3.181]
[114,"HLZ 17,5 NF Rd. 1,0","Stk","aktiv",2.7730000000000001]
[116,"HLZ 17,5 Babybl. Rd. 1,2","Stk","aktiv",4.8410000000000002]
[125,"HLZ 30,0 Babybl. Rd. 1,0","Stk","aktiv",7.5659999999999998]
[130,"HLZ 24,0 Babybl. Rd. 0,8","Stk","aktiv",7.1269999999999998]
[132,"HLZ 24,0 Babybl. Rd. 1,2","Stk","aktiv",10.097]
[1710,"evoton MZ 65    36,5","Stk","aktiv",12]
["1710-12","evoton MZ 65 HAZ 36,5-12","Stk","aktiv",6.3440000000000003]
["1710-16","evoton MZ 65 HAZ 36,5-16","Stk","aktiv",6.3440000000000003]
["1710-22","evoton MZ 65 HAZ 36,5-22","Stk","aktiv",6.3440000000000003]
[1710000000000000,"evoton MZ 65 HAZ 36,5-12","Stk","aktiv",6.5739999999999998]
[1.71E+19,"evoton MZ 65 HAZ 36,5-16","Stk","aktiv",6.5739999999999998]
[1.7099999999999999E+25,"evoton MZ 65 HAZ 36,5-22","Stk","aktiv",6.5739999999999998]
[1714,"evoton Anf.       42,5","Stk","aktiv",10.6]
[1715,"evoton Anf.       36,5","Stk","aktiv",9.3000000000000007]
[1718,"evoton MZ 65    42,5","Stk","aktiv",14.375999999999999]
["1718-12","evoton MZ 65 HAZ 42,5-12","Stk","aktiv",6.3440000000000003]
["1718-16","evoton MZ 65 HAZ 42,5-16","Stk","aktiv",6.3440000000000003]
{"$rows_left_out":1201}